{"text_format":"1","workbook":"xlsx","n_sheets":9,"sheets":["PLEASE READ ME","Page 1","Page 2","List","Municipalities","Expenditure Categories","GO Bond Debt Levies (NTC)","GO Bond Debt Levies (RMV)","Other Debt Levies"],"not_rendered":{"charts":0,"images":0,"macros":1,"external_links":0,"defined_names":1,"comments":2,"pivot_tables":0},"unopened":[],"bounds":{"document_bytes":16777216,"sheet_cells":100000,"rows_first":2000,"rows_last":500,"rows_between":2000,"halvings":0,"cell_chars":16384,"cell_head_chars":4096},"cells_cut":0,"cells_raw":0,"read":"whole","date_system":"1900"}

{"sheet":"PLEASE READ ME","index":0,"n_rows":20,"n_cols":2,"rows_kept":20,"cut":false,"hidden":false,"merged":[[19,0,19,1],[0,0,0,1],[16,0,16,1],[17,0,17,1],[18,0,18,1],[6,0,6,1]]}
["REMINDERS:"]
["1.","Use only whole numbers, round up or down as needed."]
["2.","Use only positive numbers. Formulas are in the subtotal/total cells to do the math for you."]
["3.","Fill in only highlighted areas, as applicable."]
["4.","If you are levying an amount that lands in the Misc Category, you must use the drop-down arrow to select a more specific category."]
[]
["INSTRUCTIONS:"]
["1.","If you receive a security warning, click \"Enable Content\"."]
["2.","Page 1: Select the proper municipality from the drop-down list."]
["3.","If you have debt levies, go to Page 2. It will auto-fill with the debt schedule that was provided when the bond was certified to the County."]
["4.","Fill in the \"Budget Requirement\" column.  If this amount is less than what is scheduled you will need to provide a reason and a resolution."]
["5.","If you have additional bonds that did not auto-fill, please use rows 33 - 35 for GO Bonds and rows 50 - 52 for Other Bonds."]
["6.","Go back to Page 1. Fill in the non-debt levy amounts as applicable."]
["7.","You may fax or email an advanced copy."]
["8.","Remember to sign and date the form before mailing it to the County."]
[]
["Email Address:  PRTS-Taxation-Mailbox@washingtoncountymn.gov"]
["Fax Number:  (651) 430-6155"]
["Phone Number:  (651) 430-6155"]
["Mailing Address:  Washington County, Taxation Division, PO Box 6, Stillwater, MN 55082"]
{"$rows_left_out":1}
{"sheet":"Page 1","index":1,"n_rows":57,"n_cols":5,"rows_kept":57,"cut":false,"hidden":false,"merged":[[40,0,40,4],[48,0,48,4],[50,0,50,4],[55,0,55,4],[22,0,22,4],[28,0,28,4],[27,1,27,4],[29,0,29,4],[35,0,35,4],[52,0,52,4],[53,0,53,4],[54,0,54,4],[42,0,43,2],[42,3,43,3],[42,4,43,4],[44,0,44,2],[0,0,1,4],[2,0,3,4],[4,0,4,4],[20,0,20,4],[5,1,5,3],[18,1,18,3],[19,1,19,3],[56,0,56,4],[47,0,47,2],[45,3,46,4],[47,3,47,4],[49,0,49,4],[51,0,51,4],[45,0,46,2],[36,0,36,4],[21,0,21,4],[37,0,37,4],[38,0,38,4],[39,0,39,4],[23,1,23,4],[24,1,24,4],[25,1,25,4],[26,1,26,4],[31,0,31,4],[32,1,32,4],[33,0,33,2]]}
["WASHINGTON COUNTY"]
[]
["Payable Year 2026 FINAL Property Tax Levy Certification"]
[]
["DUE: December 29, 2025"]
["Municipality:","Select a municipality from drop-down list"]
["Expenditure\nCategory","(A)\nBudget\nRequirement","(B)\nState\nAid (LGA)","(C)\nOther\nResources","(D)\nCertified Levy\n(A-B-C=D)"]
["Debt-Gen Obligation (fill in on pg 2)",{"$f":"IF(ISBLANK('Page 2'!E36),\"\",'Page 2'!E36)","v":0},null,null,{"$f":"B8-C8-D8","v":0}]
["Debt-Other (fill in on pg 2)",{"$f":"'Page 2'!E53","v":0},null,null,{"$f":"B9-C9-D9","v":0}]
["General Revenue",null,null,null,0]
["Library",null,null,null,0]
["Road and Bridge",null,null,null,0]
["Water Management Org (WMO)",null,null,null,0]
["MISC-Must select valid desc:",null,null,null,0]
["MISC-Must select valid desc:",null,null,null,0]
["MISC-Must select valid desc:",null,null,null,0]
["MISC-Must select valid desc:",null,null,null,0]
["TOTAL NET TAX CAPACITY LEVY",{"$f":"SUM(B8:B17)","v":0},{"$f":"SUM(C8:C17)","v":0},{"$f":"SUM(D8:D17)","v":0},{"$f":"SUM(E8:E17)","v":0}]
["Referenda Market Value Levy","This amount will be zero unless you have held a referendum",null,null,{"$f":"IF(ISBLANK(VLOOKUP(B6,GOBondsRMV[],5,FALSE)),\"\",VLOOKUP(B6,GOBondsRMV[],5,FALSE))","v":""}]
["TOTAL LEVY","Total Net Tax Capacity Levy + Referenda Market Value Levy = Total Levy",null,null,{"$f":"SUM(E18:E19)","v":0}]
{"$rows_left_out":38}
{"sheet":"Page 2","index":2,"n_rows":55,"n_cols":6,"rows_kept":55,"cut":false,"hidden":false,"merged":[[52,0,52,2],[54,0,54,2],[9,0,9,5],[35,0,35,2],[0,0,0,5],[1,0,1,5],[2,0,2,5],[4,0,4,5],[31,0,31,5],[48,0,48,5],[6,0,6,5]]}
[{"$f":"'Page 1'!A1:E2","v":"WASHINGTON COUNTY"}]
[{"$f":"'Page 1'!A3","v":"Payable Year 2026 FINAL Property Tax Levy Certification"}]
["DEBT SERVICE SCHEDULE"]
[]
[{"$f":"IF('Page 1'!B6=\"Select a municipality from drop-down list\",\"Please select a municipality from the drop-down list on page 1\",'Page 1'!B6)","v":"Please select a municipality from the drop-down list on page 1"}]
[]
["Only fill in the yellow highlighted areas, if they apply.  PLEASE NOTE:  IF THE AMOUNT IN THE BUDGET REQUIREMENT COLUMN IS LESS THAN THE AMOUNT IN THE BOND LEVY SCHEDULE COLUMN, YOU MUST PROVIDE AN EXPLANATION AND A RESOLUTION!"]
[]
["Bond\nDescription","Additional\nDescription","Bond #","Bond\nLevy\nSchedule","Budget\nRequirement","Explanation of Differences of Levy Schedule and Actual Levy Amounts"]
["DEBT - GENERAL OBLIGATION:"]
[{"$f":"IF(ISBLANK(VLOOKUP('Page 1'!$B$6,GOBondsNTC[#All],3,FALSE)),\"\",VLOOKUP('Page 1'!$B$6,GOBondsNTC[#All],3,FALSE))","v":""},{"$f":"IF(ISBLANK(VLOOKUP('Page 1'!$B$6,GOBondsNTC[#All],4,FALSE)),\"\",VLOOKUP('Page 1'!$B$6,GOBondsNTC[#All],4,FALSE))","v":""},{"$f":"IF(ISBLANK(VLOOKUP('Page 1'!$B$6,GOBondsNTC[#All],2,FALSE)),\"\",VLOOKUP('Page 1'!$B$6,GOBondsNTC[#All],2,FALSE))","v":""},{"$f":"IF(ISBLANK(VLOOKUP('Page 1'!$B$6,GOBondsNTC[#All],5,FALSE)),\"\",VLOOKUP('Page 1'!$B$6,GOBondsNTC[#All],5,FALSE))","v":""},{"$f":"IF(ISBLANK(D11),\"\",D11)","v":""}]
[{"$f":"IF(ISBLANK(VLOOKUP('Page 1'!$B$6,GOBondsNTC[#All],7,FALSE)),\"\",VLOOKUP('Page 1'!$B$6,GOBondsNTC[#All],7,FALSE))","v":""},{"$f":"IF(ISBLANK(VLOOKUP('Page 1'!$B$6,GOBondsNTC[#All],8,FALSE)),\"\",VLOOKUP('Page 1'!$B$6,GOBondsNTC[#All],8,FALSE))","v":""},{"$f":"IF(ISBLANK(VLOOKUP('Page 1'!$B$6,GOBondsNTC[#All],6,FALSE)),\"\",VLOOKUP('Page 1'!$B$6,GOBondsNTC[#All],6,FALSE))","v":""},{"$f":"IF(ISBLANK(VLOOKUP('Page 1'!$B$6,GOBondsNTC[#All],9,FALSE)),\"\",VLOOKUP('Page 1'!$B$6,GOBondsNTC[#All],9,FALSE))","v":""},{"$f":"IF(ISBLANK(D12),\"\",D12)","v":""}]
[{"$f":"IF(ISBLANK(VLOOKUP('Page 1'!$B$6,GOBondsNTC[#All],11,FALSE)),\"\",VLOOKUP('Page 1'!$B$6,GOBondsNTC[#All],11,FALSE))","v":""},{"$f":"IF(ISBLANK(VLOOKUP('Page 1'!$B$6,GOBondsNTC[#All],12,FALSE)),\"\",VLOOKUP('Page 1'!$B$6,GOBondsNTC[#All],12,FALSE))","v":""},{"$f":"IF(ISBLANK(VLOOKUP('Page 1'!$B$6,GOBondsNTC[#All],10,FALSE)),\"\",VLOOKUP('Page 1'!$B$6,GOBondsNTC[#All],10,FALSE))","v":""},{"$f":"IF(ISBLANK(VLOOKUP('Page 1'!$B$6,GOBondsNTC[#All],13,FALSE)),\"\",VLOOKUP('Page 1'!$B$6,GOBondsNTC[#All],13,FALSE))","v":""},""]
[{"$f":"IF(ISBLANK(VLOOKUP('Page 1'!$B$6,GOBondsNTC[#All],15,FALSE)),\"\",VLOOKUP('Page 1'!$B$6,GOBondsNTC[#All],15,FALSE))","v":""},{"$f":"IF(ISBLANK(VLOOKUP('Page 1'!$B$6,GOBondsNTC[#All],16,FALSE)),\"\",VLOOKUP('Page 1'!$B$6,GOBondsNTC[#All],16,FALSE))","v":""},{"$f":"IF(ISBLANK(VLOOKUP('Page 1'!$B$6,GOBondsNTC[#All],14,FALSE)),\"\",VLOOKUP('Page 1'!$B$6,GOBondsNTC[#All],14,FALSE))","v":""},{"$f":"IF(ISBLANK(VLOOKUP('Page 1'!$B$6,GOBondsNTC[#All],17,FALSE)),\"\",VLOOKUP('Page 1'!$B$6,GOBondsNTC[#All],17,FALSE))","v":""},""]
[{"$f":"IF(ISBLANK(VLOOKUP('Page 1'!$B$6,GOBondsNTC[#All],19,FALSE)),\"\",VLOOKUP('Page 1'!$B$6,GOBondsNTC[#All],19,FALSE))","v":""},{"$f":"IF(ISBLANK(VLOOKUP('Page 1'!$B$6,GOBondsNTC[#All],20,FALSE)),\"\",VLOOKUP('Page 1'!$B$6,GOBondsNTC[#All],20,FALSE))","v":""},{"$f":"IF(ISBLANK(VLOOKUP('Page 1'!$B$6,GOBondsNTC[#All],18,FALSE)),\"\",VLOOKUP('Page 1'!$B$6,GOBondsNTC[#All],18,FALSE))","v":""},{"$f":"IF(ISBLANK(VLOOKUP('Page 1'!$B$6,GOBondsNTC[#All],21,FALSE)),\"\",VLOOKUP('Page 1'!$B$6,GOBondsNTC[#All],21,FALSE))","v":""},""]
[{"$f":"IF(ISBLANK(VLOOKUP('Page 1'!$B$6,GOBondsNTC[#All],23,FALSE)),\"\",VLOOKUP('Page 1'!$B$6,GOBondsNTC[#All],23,FALSE))","v":""},{"$f":"IF(ISBLANK(VLOOKUP('Page 1'!$B$6,GOBondsNTC[#All],24,FALSE)),\"\",VLOOKUP('Page 1'!$B$6,GOBondsNTC[#All],24,FALSE))","v":""},{"$f":"IF(ISBLANK(VLOOKUP('Page 1'!$B$6,GOBondsNTC[#All],22,FALSE)),\"\",VLOOKUP('Page 1'!$B$6,GOBondsNTC[#All],22,FALSE))","v":""},{"$f":"IF(ISBLANK(VLOOKUP('Page 1'!$B$6,GOBondsNTC[#All],25,FALSE)),\"\",VLOOKUP('Page 1'!$B$6,GOBondsNTC[#All],25,FALSE))","v":""},""]
[{"$f":"IF(ISBLANK(VLOOKUP('Page 1'!$B$6,GOBondsNTC[#All],27,FALSE)),\"\",VLOOKUP('Page 1'!$B$6,GOBondsNTC[#All],27,FALSE))","v":""},{"$f":"IF(ISBLANK(VLOOKUP('Page 1'!$B$6,GOBondsNTC[#All],28,FALSE)),\"\",VLOOKUP('Page 1'!$B$6,GOBondsNTC[#All],28,FALSE))","v":""},{"$f":"IF(ISBLANK(VLOOKUP('Page 1'!$B$6,GOBondsNTC[#All],26,FALSE)),\"\",VLOOKUP('Page 1'!$B$6,GOBondsNTC[#All],26,FALSE))","v":""},{"$f":"IF(ISBLANK(VLOOKUP('Page 1'!$B$6,GOBondsNTC[#All],29,FALSE)),\"\",VLOOKUP('Page 1'!$B$6,GOBondsNTC[#All],29,FALSE))","v":""},""]
[{"$f":"IF(ISBLANK(VLOOKUP('Page 1'!$B$6,GOBondsNTC[#All],31,FALSE)),\"\",VLOOKUP('Page 1'!$B$6,GOBondsNTC[#All],31,FALSE))","v":""},{"$f":"IF(ISBLANK(VLOOKUP('Page 1'!$B$6,GOBondsNTC[#All],32,FALSE)),\"\",VLOOKUP('Page 1'!$B$6,GOBondsNTC[#All],32,FALSE))","v":""},{"$f":"IF(ISBLANK(VLOOKUP('Page 1'!$B$6,GOBondsNTC[#All],30,FALSE)),\"\",VLOOKUP('Page 1'!$B$6,GOBondsNTC[#All],30,FALSE))","v":""},{"$f":"IF(ISBLANK(VLOOKUP('Page 1'!$B$6,GOBondsNTC[#All],33,FALSE)),\"\",VLOOKUP('Page 1'!$B$6,GOBondsNTC[#All],33,FALSE))","v":""},""]
[{"$f":"IF(ISBLANK(VLOOKUP('Page 1'!$B$6,GOBondsNTC[#All],35,FALSE)),\"\",VLOOKUP('Page 1'!$B$6,GOBondsNTC[#All],35,FALSE))","v":""},{"$f":"IF(ISBLANK(VLOOKUP('Page 1'!$B$6,GOBondsNTC[#All],36,FALSE)),\"\",VLOOKUP('Page 1'!$B$6,GOBondsNTC[#All],36,FALSE))","v":""},{"$f":"IF(ISBLANK(VLOOKUP('Page 1'!$B$6,GOBondsNTC[#All],34,FALSE)),\"\",VLOOKUP('Page 1'!$B$6,GOBondsNTC[#All],34,FALSE))","v":""},{"$f":"IF(ISBLANK(VLOOKUP('Page 1'!$B$6,GOBondsNTC[#All],37,FALSE)),\"\",VLOOKUP('Page 1'!$B$6,GOBondsNTC[#All],37,FALSE))","v":""},""]
[{"$f":"IF(ISBLANK(VLOOKUP('Page 1'!$B$6,GOBondsNTC[#All],39,FALSE)),\"\",VLOOKUP('Page 1'!$B$6,GOBondsNTC[#All],39,FALSE))","v":""},{"$f":"IF(ISBLANK(VLOOKUP('Page 1'!$B$6,GOBondsNTC[#All],40,FALSE)),\"\",VLOOKUP('Page 1'!$B$6,GOBondsNTC[#All],40,FALSE))","v":""},{"$f":"IF(ISBLANK(VLOOKUP('Page 1'!$B$6,GOBondsNTC[#All],38,FALSE)),\"\",VLOOKUP('Page 1'!$B$6,GOBondsNTC[#All],38,FALSE))","v":""},{"$f":"IF(ISBLANK(VLOOKUP('Page 1'!$B$6,GOBondsNTC[#All],41,FALSE)),\"\",VLOOKUP('Page 1'!$B$6,GOBondsNTC[#All],41,FALSE))","v":""},""]
{"$rows_left_out":36}
{"sheet":"List","index":3,"n_rows":3,"n_cols":1,"rows_kept":3,"cut":false,"hidden":true,"merged":[]}
["Select choice"]
["appointed"]
["elected"]

{"sheet":"Municipalities","index":4,"n_rows":34,"n_cols":1,"rows_kept":34,"cut":false,"hidden":true,"merged":[]}
["Select a municipality from drop-down list"]
["City of Afton"]
["City of Bayport"]
["City of Birchwood"]
["City of Cottage Grove"]
["City of Cottage Grove HRA"]
["City of Dellwood"]
["City of Forest Lake"]
["City of Grant"]
["City of Hugo"]
["City of Lake Elmo"]
["City of Lake St Croix Beach"]
["City of Lakeland"]
["City of Lakeland Shores"]
["City of Landfall"]
["City of Mahtomedi"]
["City of Marine on St Croix"]
["City of Newport"]
["City of Oak Park Heights"]
["City of Oakdale"]
{"$rows_left_out":15}
{"sheet":"Expenditure Categories","index":5,"n_rows":15,"n_cols":1,"rows_kept":15,"cut":false,"hidden":true,"merged":[]}
["MISC-Must select valid desc:"]
["Advertising: Charter City"]
["Advertising: Statutory City"]
["Armory Bldg Comm (state, non-debt)"]
["Charter Comm Expense"]
["Comprehensive Planning (Metro)"]
["Economic Development Authority"]
["Judgments: General"]
["Judgments: Firemen"]
["Permanent Improvement & Replacement"]
["Police Pension (Relief)"]
["State Post - Audit Expense"]
["Public Works Reserve"]
["Special Asmt Improvements"]
["Special Purposes"]

{"sheet":"GO Bond Debt Levies (NTC)","index":6,"n_rows":36,"n_cols":85,"rows_kept":36,"cut":false,"hidden":true,"merged":[]}
[1,2,3,4,5,6,7,8,9,10,11,12,13,14,15,16,17,18,19,20,21,22,23,24,25,26,27,28,29,30,31,32,33,34,35,36,37,38,39,40,41,42,43,44,45,46,47,48,49,50,51,52,53,54,55,56,57,58,59,60,61,62,63,64,65,66,67,68,69,70,71,72,73,74,75,76,77,78,79,80,81,82,83,84,85]
["Entity","Bond Number 1","Description 1","Add'l Description 1","2020 Levy Amount 1","Bond Number 2","Description 2","Add'l Description 2","2020 Levy Amount 2","Bond Number 3","Description 3","Add'l Description 3","2020 Levy Amount 3","Bond Number 4","Description 4","Add'l Description 4","2020 Levy Amount 4","Bond Number 5","Description 5","Add'l Description 5","2020 Levy Amount 5","Bond Number 6","Description 6","Add'l Description 6","2020 Levy Amount 6","Bond Number 7","Description 7","Add'l Description 7","2020 Levy Amount 7","Bond Number 8","Description 8","Add'l Description 8","2020 Levy Amount 8","Bond Number 9","Description 9","Add'l Description 9","2020 Levy Amount 9","Bond Number 10","Description 10","Add'l Description 10","2020 Levy Amount 10","Bond Number 11","Description 11","Add'l Description 11","2020 Levy Amount 11","Bond Number 12","Description 12","Add'l Description 12","2020 Levy Amount 12","Bond Number 13","Description 13","Add'l Description 13","2020 Levy Amount 13","Bond Number 14","Description 14","Add'l Description 14","2020 Levy Amount 14","Bond Number 15","Description 15","Add'l Description 15","2020 Levy Amount 15","Bond Number 16","Description 16","Add'l Description 16","2020 Levy Amount 16","Bond Number 17","Description 17","Add'l Description 17","2020 Levy Amount 17","Bond Number 18","Description 18","Add'l Description 18","2020 Levy Amount 18","Bond Number 19","Description 19","Add'l Description 19","2020 Levy Amount 19","Bond Number 20","Description 20","Add'l Description 20","2020 Levy Amount 20","Bond Number 21","Description 21","Add'l Description 21","2020 Levy Amount 21"]
["Select a municipality from drop-down list"]
["City of Afton",1807,"Series 2014A","GO Tax Abatement Refunding Bonds",28525,1872,"Series 2017B","GO Tax Abatement Bonds",37716,1879,"","GO Storm Water Improvement Note of 2017",2949,1880,"","GO Sanitary Sewer Improvement Note of 2017",3609]
["City of Bayport",1817,"Series 2015A","GO Capital Improvement Plan Bonds",176282]
["City of Birchwood"]
["City of Cottage Grove",1724,"Series 2012A","GO Improvement Bonds",42424,1813,"Series 2015A","GO Improvement Bonds",318269,1836,"Series 2016A","G.O. Refunding Bonds",412335,1863,"Series 2016B","GO Improvement Bonds",197604,1873,"Series 2017A","GO Capital Improvement Plan Bonds",639266,1901,"Series 2018A","GO Improvement Bond",384019,1918,"Series 2019B","GO Equipment Certificates",350017,1919,"Series 2019A","GO Capital Improvement Plan Bonds",294193,1975,"Series 2021A","GO Improvement Bonds",252172,1985,"Series 2021B","GO Improvement Refunding Bonds",514350,2005,"Series 2023A","GO Improvement and Tax Abatement Bonds",361027,2019,"Series 2024A","GO Improvement and Capital Equipment Bonds",549437,2036,"Series 2025A","GO Equipment, Pavement, Construction and Irrigation",867545]
["City of Cottage Grove HRA"]
["City of Dellwood",2007,"Series 2023A","GO Street Reconstruction Bonds",429712]
["City of Forest Lake",1799,"Series 2014A","GO Tax Abatement Bonds",632822,1935,"Series 2019A","GO Bonds",1818180,2029,"Series 2024A","GO Equipment Certificates",299932,2041,"Series 2025A","GO Street Reconstruction Plan Bonds",401363]
["City of Grant"]
["City of Hugo",1715,"Series 2011A","GO Improvement Bonds",18228,1957,"Series 2020A","GO Capital Improvement Plan Bonds",434096,1980,"Series 2021A","GO Tax Abatement Bonds",538429]
["City of Lake Elmo",1796,"Series 2014A","General Obligation Bond",183829,1849,"Series 2016A","GO Bonds",186164,1877,"Series 2017A","Improvements Project",342004,1914,"Series 2018A","GO Equipment Certificates",125139,1931,"Series 2019A","GO Bonds",290419,1982,"Series 2021A","GO Improvement, CIP, & Refunding Bond",1019630,1997,"Series 2022A","GO Improvement, Abatement and Utility Revenue",279510,2011,"Series 2023A","GO Improvement and Utility Revenue Bonds",354075,2028,"Series 2024A","GO Improvement and Water Revenue Bonds",438248,2049,"Series 2025A","GO Improvement Bonds",212553]
["City of Lake St Croix Beach"]
["City of Lakeland",1821,"2015A","GO Crossover Refunding Bonds",47513]
["City of Lakeland Shores"]
["City of Landfall"]
["City of Mahtomedi",1842,"Series 2016A","GO Improvement & Refunding Bonds",547326,1896,"Series 2018A","GO Improvement & Utility Revenue Bonds",351518,1940,"Series 2020A","GO Improve, Street & Utility Bond",659849]
["City of Marine on St Croix"]
["City of Newport",1797,"Series 2014A","GO Improvement Bonds",214843,1869,"Series 2016A","GO Improvement Bonds",94712,1905,"Series 2018A","GO Improvement Bond",264561,1965,"Series 2021A","GO Bond",545267]
{"$rows_left_out":17}
{"sheet":"GO Bond Debt Levies (RMV)","index":7,"n_rows":36,"n_cols":85,"rows_kept":36,"cut":false,"hidden":true,"merged":[]}
[1,2,3,4,5,6,7,8,9,10,11,12,13,14,15,16,17,18,19,20,21,22,23,24,25,26,27,28,29,30,31,32,33,34,35,36,37,38,39,40,41,42,43,44,45,46,47,48,49,50,51,52,53,54,55,56,57,58,59,60,61,62,63,64,65,66,67,68,69,70,71,72,73,74,75,76,77,78,79,80,81,82,83,84,85]
["Entity","Bond Number 1","Description 1","Add'l Description 1","2020 Levy Amount 1","Bond Number 2","Description 2","Add'l Description 2","2020 Levy Amount 2","Bond Number 3","Description 3","Add'l Description 3","2020 Levy Amount 3","Bond Number 4","Description 4","Add'l Description 4","2020 Levy Amount 4","Bond Number 5","Description 5","Add'l Description 5","2020 Levy Amount 5","Bond Number 6","Description 6","Add'l Description 6","2020 Levy Amount 6","Bond Number 7","Description 7","Add'l Description 7","2020 Levy Amount 7","Bond Number 8","Description 8","Add'l Description 8","2020 Levy Amount 8","Bond Number 9","Description 9","Add'l Description 9","2020 Levy Amount 9","Bond Number 10","Description 10","Add'l Description 10","2020 Levy Amount 10","Bond Number 11","Description 11","Add'l Description 11","2020 Levy Amount 11","Bond Number 12","Description 12","Add'l Description 12","2020 Levy Amount 12","Bond Number 13","Description 13","Add'l Description 13","2020 Levy Amount 13","Bond Number 14","Description 14","Add'l Description 14","2020 Levy Amount 14","Bond Number 15","Description 15","Add'l Description 15","2020 Levy Amount 15","Bond Number 16","Description 16","Add'l Description 16","2020 Levy Amount 16","Bond Number 17","Description 17","Add'l Description 17","2020 Levy Amount 17","Bond Number 18","Description 18","Add'l Description 18","2020 Levy Amount 18","Bond Number 19","Description 19","Add'l Description 19","2020 Levy Amount 19","Bond Number 20","Description 20","Add'l Description 20","2020 Levy Amount 20","Bond Number 21","Description 21","Add'l Description 21","2020 Levy Amount 21"]
["Select a municipality from drop-down list"]
["City of Afton"]
["City of Bayport"]
["City of Birchwood"]
["City of Cottage Grove"]
["City of Cottage Grove HRA"]
["City of Dellwood"]
["City of Forest Lake"]
["City of Grant"]
["City of Hugo"]
["City of Lake Elmo"]
["City of Lake St Croix Beach"]
["City of Lakeland"]
["City of Lakeland Shores"]
["City of Landfall"]
["City of Mahtomedi"]
["City of Marine on St Croix"]
["City of Newport"]
{"$rows_left_out":17}
{"sheet":"Other Debt Levies","index":8,"n_rows":36,"n_cols":41,"rows_kept":36,"cut":false,"hidden":true,"merged":[]}
[1,2,3,4,5,6,7,8,9,10,11,12,13,14,15,16,17,18,19,20,21,22,23,24,25,26,27,28,29,30,31,32,33,34,35,36,37,38,39,40,41]
["Entity","Bond Number 1","Description 1","Add'l Description 1","2020 Levy Amount 1","Bond Number 2","Description 2","Add'l Description 2","2020 Levy Amount 2","Bond Number 3","Description 3","Add'l Description 3","2020 Levy Amount 3","Bond Number 4","Description 4","Add'l Description 4","2020 Levy Amount 4","Bond Number 5","Description 5","Add'l Description 5","2020 Levy Amount 5","Bond Number 6","Description 6","Add'l Description 6","2020 Levy Amount 6","Bond Number 7","Description 7","Add'l Description 7","2020 Levy Amount 7","Bond Number 8","Description 8","Add'l Description 8","2020 Levy Amount 8","Bond Number 9","Description 9","Add'l Description 9","2020 Levy Amount 9","Bond Number 10","Description 10","Add'l Description 10","2020 Levy Amount 10"]
["Select a municipality from drop-down list"]
["City of Afton"]
["City of Bayport"]
["City of Birchwood"]
["City of Cottage Grove"]
["City of Cottage Grove HRA"]
["City of Dellwood"]
["City of Forest Lake"]
["City of Grant"]
["City of Hugo"]
["City of Lake Elmo"]
["City of Lake St Croix Beach"]
["City of Lakeland"]
["City of Lakeland Shores"]
["City of Landfall"]
["City of Mahtomedi"]
["City of Marine on St Croix"]
["City of Newport"]
{"$rows_left_out":16}